mvn -Dgwt-i18n process-test-resources: GWT Module org.zanata.webtrans.ApplicationI18n not found in project sources or resources

Description

I ran

mvn -e -Dgwt-i18n process-test-resources -DskipTests -DskipFuncTests

and I got

[INFO] ------------------------------------------------------------------------
[INFO] Reactor Summary:
[INFO]
[INFO] Zanata Parent POM .................................. SUCCESS [ 0.586 s]
[INFO] Zanata API modules ................................. SUCCESS [ 0.087 s]
[INFO] Zanata Common API .................................. SUCCESS [ 2.538 s]
[INFO] Zanata common modules .............................. SUCCESS [ 0.081 s]
[INFO] Zanata Common Utility Code ......................... SUCCESS [ 0.111 s]
[INFO] Zanata Adapter for Gettext PO ...................... SUCCESS [ 0.107 s]
[INFO] Zanata Adapter for Java Properties ................. SUCCESS [ 0.094 s]
[INFO] Zanata Adapter for XLIFF file ...................... SUCCESS [ 0.108 s]
[INFO] Zanata Adapter for Glossary ........................ SUCCESS [ 0.102 s]
[INFO] Zanata client modules .............................. SUCCESS [ 0.085 s]
[INFO] stub-server ........................................ SUCCESS [ 0.152 s]
[INFO] Zanata Rest client ................................. SUCCESS [ 0.131 s]
[INFO] Zanata client commands ............................. SUCCESS [ 0.178 s]
[INFO] Zanata command-line client ......................... SUCCESS [ 0.138 s]
[INFO] Zanata Maven Plugin ................................ SUCCESS [ 1.030 s]
[INFO] Zanata server modules .............................. SUCCESS [ 0.240 s]
[INFO] zanata-liquibase ................................... SUCCESS [ 0.201 s]
[INFO] Zanata model ....................................... SUCCESS [ 0.274 s]
[INFO] Zanata frontend .................................... SUCCESS [02:03 min]
[INFO] gwt-editor ......................................... SUCCESS [ 0.263 s]
[INFO] Zanata web application ............................. FAILURE [ 13.867 s]
[INFO] zanata-test-war .................................... SKIPPED
[INFO] functional-test .................................... SKIPPED
[INFO] Zanata Platform .................................... SKIPPED
[INFO] ------------------------------------------------------------------------
[INFO] BUILD FAILURE
[INFO] ------------------------------------------------------------------------
[INFO] Total time: 02:25 min
[INFO] Finished at: 2016-11-08T11:34:53+10:00
[INFO] Final Memory: 109M/1363M
[INFO] ------------------------------------------------------------------------
[ERROR] Failed to execute goal org.codehaus.mojo:gwt-maven-plugin:2.8.0:compile (generate-i18n) on project zanata-war: GWT Module org.zanata.webtrans.ApplicationI18n not found in project sources or resources. -> [Help 1]
org.apache.maven.lifecycle.LifecycleExecutionException: Failed to execute goal org.codehaus.mojo:gwt-maven-plugin:2.8.0:compile (generate-i18n) on project zanata-war: GWT Module org.zanata.webtrans.ApplicationI18n not found in project sources or resources.
at org.apache.maven.lifecycle.internal.MojoExecutor.execute(MojoExecutor.java:212)
at org.apache.maven.lifecycle.internal.MojoExecutor.execute(MojoExecutor.java:153)
at org.apache.maven.lifecycle.internal.MojoExecutor.execute(MojoExecutor.java:145)
at org.apache.maven.lifecycle.internal.LifecycleModuleBuilder.buildProject(LifecycleModuleBuilder.java:116)
at org.apache.maven.lifecycle.internal.LifecycleModuleBuilder.buildProject(LifecycleModuleBuilder.java:80)
at org.apache.maven.lifecycle.internal.builder.singlethreaded.SingleThreadedBuilder.build(SingleThreadedBuilder.java:51)
at org.apache.maven.lifecycle.internal.LifecycleStarter.execute(LifecycleStarter.java:128)
at org.apache.maven.DefaultMaven.doExecute(DefaultMaven.java:307)
at org.apache.maven.DefaultMaven.doExecute(DefaultMaven.java:193)
at org.apache.maven.DefaultMaven.execute(DefaultMaven.java:106)
at org.apache.maven.cli.MavenCli.execute(MavenCli.java:863)
at org.apache.maven.cli.MavenCli.doMain(MavenCli.java:288)
at org.apache.maven.cli.MavenCli.main(MavenCli.java:199)
at sun.reflect.NativeMethodAccessorImpl.invoke0(Native Method)
at sun.reflect.NativeMethodAccessorImpl.invoke(NativeMethodAccessorImpl.java:62)
at sun.reflect.DelegatingMethodAccessorImpl.invoke(DelegatingMethodAccessorImpl.java:43)
at java.lang.reflect.Method.invoke(Method.java:498)
at org.codehaus.plexus.classworlds.launcher.Launcher.launchEnhanced(Launcher.java:289)
at org.codehaus.plexus.classworlds.launcher.Launcher.launch(Launcher.java:229)
at org.codehaus.plexus.classworlds.launcher.Launcher.mainWithExitCode(Launcher.java:415)
at org.codehaus.plexus.classworlds.launcher.Launcher.main(Launcher.java:356)
Caused by: org.apache.maven.plugin.MojoExecutionException: GWT Module org.zanata.webtrans.ApplicationI18n not found in project sources or resources.
at org.codehaus.mojo.gwt.shell.CompileMojo.compilationRequired(CompileMojo.java:638)
at org.codehaus.mojo.gwt.shell.CompileMojo.compile(CompileMojo.java:502)
at org.codehaus.mojo.gwt.shell.CompileMojo.doExecute(CompileMojo.java:387)
at org.codehaus.mojo.gwt.shell.AbstractGwtShellMojo.execute(AbstractGwtShellMojo.java:162)
at org.apache.maven.plugin.DefaultBuildPluginManager.executeMojo(DefaultBuildPluginManager.java:134)
at org.apache.maven.lifecycle.internal.MojoExecutor.execute(MojoExecutor.java:207)
... 20 more
Caused by: org.codehaus.mojo.gwt.utils.GwtModuleReaderException: GWT Module org.zanata.webtrans.ApplicationI18n not found in project sources or resources.
at org.codehaus.mojo.gwt.AbstractGwtModuleMojo.readModule(AbstractGwtModuleMojo.java:198)
at org.codehaus.mojo.gwt.shell.CompileMojo.compilationRequired(CompileMojo.java:552)
... 25 more
[ERROR]

Environment

None

Status

Assignee

Patrick Huang

Reporter

Ding-Yi Chen

Labels

None

Tested Version/s

None

Sprint

None

Fix versions

Priority

High
Configure